{"text_format":"1","workbook":"xlsx","n_sheets":11,"sheets":["Explications","Nature","Partenaires","Structure projet ","BdD","Amortissements","Description des couts ","Synthese","Aide prévisionnelle","CheckList","Synthèse par LOT"],"not_rendered":{"charts":7,"images":6,"macros":1,"external_links":1,"defined_names":14,"comments":4,"pivot_tables":27},"unopened":[],"bounds":{"document_bytes":16777216,"sheet_cells":100000,"rows_first":2000,"rows_last":500,"rows_between":2000,"halvings":0,"cell_chars":16384,"cell_head_chars":4096},"cells_cut":0,"cells_raw":0,"read":"whole","date_system":"1900"}

{"sheet":"Explications","index":0,"n_rows":36,"n_cols":494,"rows_kept":36,"cut":false,"hidden":false,"merged":[[23,493,23,499],[1,1,2,12],[14,493,14,499],[19,493,19,499],[20,493,20,499],[4,493,4,499],[6,493,6,499],[7,493,11,499],[3,493,3,499],[13,493,13,499],[4,3,4,10],[9,3,9,10],[5,3,5,6],[5,7,5,10],[6,3,6,6],[6,7,6,10],[35,3,37,10],[20,3,20,10],[10,3,10,10],[13,3,13,10],[14,3,15,10],[28,3,31,10],[21,3,22,10],[23,3,24,10],[27,3,27,10],[34,3,34,10],[18,3,18,10],[17,3,17,10]]}
[]
[null,"Base de données des coûts du projet\nAppel à Projets\nInvestissements d'Avenir ADEME",null,null,null,null,null,null,null,null,null,null,null,null,"Garder la protection",null,"Oui"]
[]
[null,null,null,null,null,null,null,"version 2.7 ADEME du 19 decembre 2019",null,null,null,null,null,null,null,null,null,null,null,null,null,null,null,null,null,null,null,null,null,null,null,null,null,null,null,null,null,null,null,null,null,null,null,null,null,null,null,null,null,null,null,null,null,null,null,null,null,null,null,null,null,null,null,null,null,null,null,null,null,null,null,null,null,null,null,null,null,null,null,null,null,null,null,null,null,null,null,null,null,null,null,null,null,null,null,null,null,null,null,null,null,null,null,null,null,null,null,null,null,null,null,null,null,null,null,null,null,null,null,null,null,null,null,null,null,null,null,null,null,null,null,null,null,null,null,null,null,null,null,null,null,null,null,null,null,null,null,null,null,null,null,null,null,null,null,null,null,null,null,null,null,null,null,null,null,null,null,null,null,null,null,null,null,null,null,null,null,null,null,null,null,null,null,null,null,null,null,null,null,null,null,null,null,null,null,null,null,null,null,null,null,null,null,null,null,null,null,null,null,null,null,null,null,null,null,null,null,null,null,null,null,null,null,null,null,null,null,null,null,null,null,null,null,null,null,null,null,null,null,null,null,null,null,null,null,null,null,null,null,null,null,null,null,null,null,null,null,null,null,null,null,null,null,null,null,null,null,null,null,null,null,null,null,null,null,null,null,null,null,null,null,null,null,null,null,null,null,null,null,null,null,null,null,null,null,null,null,null,null,null,null,null,null,null,null,null,null,null,null,null,null,null,null,null,null,null,null,null,null,null,null,null,null,null,null,null,null,null,null,null,null,null,null,null,null,null,null,null,null,null,null,null,null,null,null,null,null,null,null,null,null,null,null,null,null,null,null,null,null,null,null,null,null,null,null,null,null,null,null,null,null,null,null,null,null,null,null,null,null,null,null,null,null,null,null,null,null,null,null,null,null,null,null,null,null,null,null,null,null,null,null,null,null,null,null,null,null,null,null,null,null,null,null,null,null,null,null,null,null,null,null,null,null,null,null,null,null,null,null,null,null,null,null,null,null,null,null,null,null,null,null,null,null,null,null,null,null,null,null,null,null,null,null,null,null,null,null,null,null,null,null,null,null,null,null,null,null,null,null,null,null,null,null,null,null,null,null,null,null,null,null,null,null,null,null,null,null,null,null,null,null,null,null,"  Principes généraux"]
[null,null,null,"  Principes généraux",null,null,null,null,null,null,null,null,null,null,null,null,null,null,null,null,null,null,null,null,null,null,null,null,null,null,null,null,null,null,null,null,null,null,null,null,null,null,null,null,null,null,null,null,null,null,null,null,null,null,null,null,null,null,null,null,null,null,null,null,null,null,null,null,null,null,null,null,null,null,null,null,null,null,null,null,null,null,null,null,null,null,null,null,null,null,null,null,null,null,null,null,null,null,null,null,null,null,null,null,null,null,null,null,null,null,null,null,null,null,null,null,null,null,null,null,null,null,null,null,null,null,null,null,null,null,null,null,null,null,null,null,null,null,null,null,null,null,null,null,null,null,null,null,null,null,null,null,null,null,null,null,null,null,null,null,null,null,null,null,null,null,null,null,null,null,null,null,null,null,null,null,null,null,null,null,null,null,null,null,null,null,null,null,null,null,null,null,null,null,null,null,null,null,null,null,null,null,null,null,null,null,null,null,null,null,null,null,null,null,null,null,null,null,null,null,null,null,null,null,null,null,null,null,null,null,null,null,null,null,null,null,null,null,null,null,null,null,null,null,null,null,null,null,null,null,null,null,null,null,null,null,null,null,null,null,null,null,null,null,null,null,null,null,null,null,null,null,null,null,null,null,null,null,null,null,null,null,null,null,null,null,null,null,null,null,null,null,null,null,null,null,null,null,null,null,null,null,null,null,null,null,null,null,null,null,null,null,null,null,null,null,null,null,null,null,null,null,null,null,null,null,null,null,null,null,null,null,null,null,null,null,null,null,null,null,null,null,null,null,null,null,null,null,null,null,null,null,null,null,null,null,null,null,null,null,null,null,null,null,null,null,null,null,null,null,null,null,null,null,null,null,null,null,null,null,null,null,null,null,null,null,null,null,null,null,null,null,null,null,null,null,null,null,null,null,null,null,null,null,null,null,null,null,null,null,null,null,null,null,null,null,null,null,null,null,null,null,null,null,null,null,null,null,null,null,null,null,null,null,null,null,null,null,null,null,null,null,null,null,null,null,null,null,null,null,null,null,null,null,null,null,null,null,null,null,null,null,null,null,null,null,null,null,null,null,null,null,null,null,null,null,null,null,null,null,null,null,null,null,null,null,null,null,null,null,null,null,null,"Le document contient 3 types d'onglets :\n1/ Onglets blancs : aide au remplissage de la base de données\n2/ Onglets bleus : informations à compléter par les partenaires\n3/ Onglets gris : tableaux d'évaluation destinés à l'ADEME et automatiquement générés (aucune action des partenaires)"]
[null,null,null,"Le document contient 3 types d'onglets :",null,null,null,"Les onglets bleus contiennent 2 types de cellules  :"]
{"$rows_left_out":31}
{"sheet":"Nature","index":1,"n_rows":10,"n_cols":8,"rows_kept":10,"cut":false,"hidden":false,"merged":[[6,1,6,7],[1,1,1,7],[3,3,3,4],[4,3,4,4],[3,5,3,7],[4,5,4,7],[4,1,4,2],[3,1,3,2]]}
[]
[null,"Définition des catégories d'aide "]
[null,"Les coûts admissibles de recherche et de développement sont affectés à une catégorie spécifique (recherche industrielle, développement expérimental, protection de l'environnement)"]
[null,"RI (Recherche Industrielle)",null,"DE (Développement Expérimental)",null,"PE (Protection de l'Environnement)"]
[null,"Les aides sont octroyées directement à l’organisme de recherche et de diffusion des connaissances et ne comportent pas l’octroi direct d’une aide sans rapport avec la recherche visées.\n\nLes aides releve intégralement de la catégorie suivante :\n\n- \"Recherche industrielle\", définie comme la recherche planifiée ou des enquêtes critiques visant à acquérir de nouvelles connaissances et aptitudes en vue de mettre au point de nouveaux produits, procédés ou services, ou d'entraîner une amélioration notable de produits, procédés ou services existants. Elle comprend la création de composants de systèmes complexes et peut inclure la construction de prototypes dans un environnement de laboratoire ou dans un environnement à interfaces simulées vers les systèmes existants, ainsi que des lignes pilotes, lorsque c'est nécessaire pour la recherche industrielle, et notamment pour la validation de technologies génériques;",null,"Les aides releve intégralement des catégories suivantes :\n\n\"Développement expérimental\", définie comme l'acquisition, l'association, la mise en forme et l'utilisation de connaissances et d'aptitudes scientifiques, technologiques, commerciales et autres pertinentes en vue de développer des produits, des procédés ou des services nouveaux ou améliorés. \nIl peut aussi s'agir, par exemple, d'activités visant la définition théorique et la planification de produits, de procédés ou de services nouveaux, ainsi que la consignation des informations qui s'y rapportent.\nLe développement expérimental peut comprendre la création de prototypes, la démonstration, l'élaboration de projets pilotes, les essais et la validation de produits, de procédés ou de services nouveaux ou améliorés dans des environnements représentatifs des conditions de la vie réelle, lorsque l'objectif premier est d'apporter des améliorations supplémentaires, au niveau technique, aux produits, procédés ou services qui ne sont pas en grande partie «fixés». Il peut comprendre la création de prototypes et de projets pilotes commercialement exploitables qui sont nécessairement les produits commerciaux finals et qui sont trop onéreux à produire pour être utilisés uniquement à des fins de démonstration et de validation. \nLe développement expérimental ne comprend pas les modifications de routine ou périodiques apportées à des produits, lignes de production, procédés de fabrication et services existants et à d'autres opérations en cours, même si ces modifications peuvent représenter des améliorations;\n",null,"Les coût éligibles sont définis comme les coûts d'investissements supplémentaires nécessaires pour :\n\n- atteindre un niveau de protection de l'environnement supérieur au niveau requis par les normes communautaires concernées\n- ou augmenter le niveau de protection de l’environnement découlant de l'activité en l’absence de normes de l’Union,\nabstraction faite des bénéfices et des coûts d'exploitation. \n\nLes aides ne sont pas autorisées lorsque les investissements sont réalisés afin de garantir que les entreprises se conforment à des normes de l'Union déjà adoptées mais non encore entrées en vigueur , excepté lorsque l’aide est octroyée aux fins suivantes :\na) l'acquisition de nouveaux véhicules de transport routier, ferroviaire, fluvial et maritime conformes aux normes de l'Union adoptées, sous réserve que celles-ci ne soient pas entrées en vigueur avant la date d'acquisition des véhicules et qu'une fois obligatoires, elles ne s'appliquent pas à des véhicules déjà acquis ;\nb) le post-équipement de véhicules existants destinés au transport routier, ferroviaire, fluvial et maritime, sous réserve que les normes de l'Union ne soient pas entrées en vigueur avant la date de mise en service de ces véhicules et qu'une fois devenues obligatoires, elles ne s'appliquent pas à ces derniers de façon rétroactive\n\nIls sont déterminés comme suit:\na) si les coûts de l'investissement dans la protection de l'environnement peuvent être identifiés comme investissement distinct dans les coûts d'investissement totaux, ces coûts liés à la protection de l'environnement constituent les coûts admissibles ;\nb) dans tous les autres cas, les coûts de l'investissement dans la protection de l'environnement sont déterminés par référence à un investissement similaire, moins respectueux de l'environnement, qui aurait été plausible en l'absence d'aide. La différence entre les coûts des deux investissements représente les coûts liés à la protection de l'environnement et constitue les coûts admissibles."]
[]
{"$rows_left_out":5}
{"sheet":"Partenaires","index":2,"n_rows":36,"n_cols":12,"rows_kept":36,"cut":false,"hidden":false,"merged":[[16,0,16,6],[2,1,2,2],[4,7,14,15],[0,0,0,4]]}
["Définition des taux d'aide"]
[]
["AAP",null,null,null,"Nom Projet",null,null,"Durée (mois)",24,null,"Projet coopératif","Oui"]
[]
["Nom court du partenaire",null,null,null,null,null,null,"La catégorie d'entreprise et assimilé :\n\nGE : Grande Entreprise; \nETI : Entreprise de Taille Intermédiaire\nPE : Petite et Moyenne Entreprise\n* Définition : https://www.legifrance.gouv.fr/affichTexte.do?cidTexte=JORFTEXT000019961059\n\nLes établissements de recherche (ER) regroupent notamment les EPST, les EPA et les EPIC.\nDeux catégories d'aides sont proposées (si ce choix a été fait une première fois, ce financement s'appliquera durant toute la suite du Programme d'investissements d'avenir) :\n\n- ER aidés à 50% sur les coûts complets\n  Dans ce cas, dans l'onglet BDD veuillez renseigner les colonnes \"Salaire cat\" (O,P,Q,R,S), salaires chargés non environnés affectés au projet de tous les personnels (permanants et non permanants) \n\n- ER aidés à 100% sur les coûts marginaux.\n  Dans ce cas, dans l'onglet BDD, veuillez renseigner  les colonnes \"Salaire cat\" (O,P,Q,R,S), salaires chargés non environnés affectés au projet ainsi que la colonne U \"dont salaires personnels permanents (statutaires organismes publics)\" (salaires chargés non environnés également)\n\nOn entend par « coût marginal » les dépenses réelles additionnelles et  les charges d’amortissement des équipements  spécifiques à la mise en oeuvre du projet. Les frais généraux ou indirects ne sont pas inclus dans ces dépenses réelles et sont calculés forfaitairement. \n\nCependant, si l'activité issue du projet revêt un caractère concurentiel menant à la création de valeur, un établissement de recherche (EPIC, EPA, EPST) pourra être classé en \"acteur soumis au secteur concurrentiel\" (GE, ETI, PME)."]
["Catégorie d'entreprise ou assimilé"]
{"$rows_left_out":31}
{"sheet":"Structure projet ","index":3,"n_rows":100,"n_cols":6,"rows_kept":100,"cut":false,"hidden":false,"merged":[]}
[]
[null,"Lot","Tache","Sous-tache","Code","Intitulé de l'activité"]
[null,"LOT 0",1,1,{"$f":"CONCATENATE(B3,C3,D3)","v":"LOT 011"},"test"]
[null,null,null,null,{"$f":"CONCATENATE(B4,C4,D4)","v":""}]
[null,null,null,null,""]
[null,null,null,null,""]
{"$rows_left_out":95}
{"sheet":"BdD","index":4,"n_rows":21,"n_cols":45,"rows_kept":21,"cut":false,"hidden":false,"merged":[[1,6,1,8],[2,6,2,8],[0,0,0,6],[20,20,20,44],[20,0,20,1]]}
["Base de données des coûts du projet",null,null,null,null,null,null,null,null,"Homme.mois cat 1","Homme.mois cat 2","Homme.mois cat 3","Homme.mois cat 4","Homme.mois cat 5","Total Homme.mois",null,null,null,null,null,"Salaires chargés non environnés","dont salaires personnels permanents","dont salaires sans pers. permanents","Frais connexes","Coûts de sous-traitance","Contribution aux amortissements","Coût de refacturation interne","Frais de Mission","Autres coûts","Commentaires","Total des coûts",null,null,"Total coûts RI","Total coûts DE","Total coûts PE","Coûts PE admissibles","Total coûts éligibles et retenus","Total coûts non éligibles","Total coûts non retenus","Total coûts PE non admissibles","Total coûts non éligibles et non retenus","Subventions","Avances remboursables","Aide totale"]
[null,null,null,null,null,null,"TOTAL =>",null,null,{"$f":"SUM(J5:J22)","v":0},0,0,0,0,0,null,null,null,null,null,{"$f":"SUM(U5:U22)","v":0},{"$f":"SUM(V5:V22)","v":0},{"$f":"SUM(W4:W20)","v":0},0,0,0,0,0,0,null,{"$f":"SUM(AE4:AE20)","v":0},null,null,{"$f":"SUM(AH5:AH22)","v":0},0,0,0,0,0,0,0,0,0,0,0]
[null,null,null,null,{"$f":"IF(Partenaires!F3=\"\",\"\",Partenaires!F3)","v":""},null,"SOUS-TOTAL =>",null,null,{"$f":"SUBTOTAL(9,J5:J22)","v":0},0,0,0,0,0,null,null,null,null,null,{"$f":"SUBTOTAL(9,U5:U22)","v":0},{"$f":"SUBTOTAL(9,V5:V22)","v":0},{"$f":"SUBTOTAL(9,W4:W20)","v":0},0,0,0,0,0,0,null,{"$f":"SUBTOTAL(9,AE4:AE20)","v":0},null,null,{"$f":"SUBTOTAL(9,AH5:AH21)","v":0},{"$f":"SUBTOTAL(9,AI5:AI21)","v":0},{"$f":"SUBTOTAL(9,AJ5:AJ21)","v":0},{"$f":"SUBTOTAL(9,AK5:AK21)","v":0},{"$f":"SUBTOTAL(9,AL5:AL21)","v":0},{"$f":"SUBTOTAL(9,AM5:AM22)","v":0},0,0,0,0,0,0]
[null,null,null,null,null,null,null,null,null,null,"PASSER LA SOURIS SUR LES CELLULES BLEUES POUR VISUALISER LES COMMENTAIRES",null,null,null,null,null,null,null,"PASSER LA SOURIS SUR LES CELLULES BLEUES POUR VISUALISER LES COMMENTAIRES",null,null,null,null,null,null,null,null,null,"PASSER LA SOURIS SUR LES CELLULES BLEUES POUR VISUALISER LES COMMENTAIRES"]
["Lot","Tache","Sous-tache","Code","Intitulé de l'activité","Partenaire","Semestre","Livrable","Etape-clef","Homme.mois cat 1","Homme.mois cat 2","Homme.mois cat 3","Homme.mois cat 4","Homme.mois cat 5","Total Homme.mois","Salaires cat 1","Salaires cat 2","Salaires cat 3","Salaires cat 4","Salaires cat 5","Salaires chargés non environnés","dont salaires personnels permanents (statutaires organismes publics)","dont salaires sans pers. permanents","Frais connexes (forfaitaires)","Coûts de sous-traitance","Contributions aux amortissements","Coûts de refacturation interne","Frais de mission","Autres coûts","Commentaires","Total des coûts","Classification","Taux aide","Total coûts RI","Total coûts DE","Total coûts PE","Total coûts PE admissibles","Total coûts éligibles et retenus","Total coûts non éligibles","Total coûts non retenus","Total coûts PE non admissibles","Total coûts non éligibles et non retenus","Subventions","Avances remboursables","Aide totale"]
[null,null,null,{"$f":"CONCATENATE(A6,B6,C6)","v":""},{"$f":"IFERROR(VLOOKUP(D6,'Structure projet '!E:F,2,FALSE),\"\")","v":0},null,null,null,null,null,null,null,null,null,{"$f":"SUM(J6:N6)","v":0},null,null,null,null,null,{"$f":"J6*P6+K6*Q6+L6*R6+M6*S6+N6*T6","v":0},null,{"$f":"IF(U6-V6=0,0,U6-V6)","v":0},{"$f":"IF(F6=\"\",0,IF(AF6=\"PE\",0,IF(OR(HLOOKUP(F6,Matrice_clefs,2,FALSE)=\"ER 50%*coûts complets\",HLOOKUP(F6,Matrice_clefs,2,FALSE)=\"GE\",HLOOKUP(F6,Matrice_clefs,2,FALSE)=\"ME\",HLOOKUP(F6,Matrice_clefs,2,FALSE)=\"PE\"),20%*U6,IF(HLOOKUP(F6,Matrice_clefs,2,FALSE)=\"ER 100%*coûts marginaux\",4%*Z6+8%*SUM(W6,Y6,AA6:AC6),0))))","v":0},null,null,null,null,null,null,{"$f":"U6+SUM(X6:AC6)","v":0},null,{"$f":"IF(F6=\"\",0,IF(AF6=\"RI\",N(HLOOKUP($F6,Matrice_clefs,6,FALSE)),IF(AF6=\"DE\",N(HLOOKUP($F6,Matrice_clefs,7,FALSE)),IF(AF6=\"PE\",N(HLOOKUP($F6,Matrice_clefs,8,FALSE)),0))))","v":0},{"$f":"IF(F6=\"\",0,IF(OR(AF6=\"DE\",AF6=\"NE\",AF6=\"NR\",AF6=\"PE\"),0,IF(HLOOKUP(F6,Matrice_clefs,2,FALSE)=\"ER 100%*coûts marginaux\",AE6-V6,IF(AF6=\"RI\",AE6,0))))","v":0},{"$f":"IF(OR(AF6=\"RI\",AF6=\"NE\",AF6=\"NR\",AF6=\"PE\"),0,IF(AF6=\"DE\",AE6-V6,0))","v":0},{"$f":"IF(AF6=\"PE\",AE6-V6,0)","v":0},{"$f":"IF(AF6=\"PE\",AJ6-(AJ6*N(HLOOKUP($F6,Matrice_clefs,9,FALSE))/N(HLOOKUP($F6,Matrice_clefs,10,FALSE))),0)","v":0},{"$f":"AH6+AI6+AK6","v":0},{"$f":"IF(AF6=\"NE\",AE6,V6)","v":0},{"$f":"IF(AF6=\"NR\",AE6,0)","v":0},{"$f":"IF(AF6=\"PE\",AJ6-AK6,0)","v":0},{"$f":"AM6+AN6+AO6","v":0},{"$f":"AS6-AR6","v":0},{"$f":"IF(F6=\"\",0,$AS6*N(HLOOKUP($F6,Matrice_clefs,5,FALSE)))","v":0},{"$f":"AL6*AG6","v":0}]
{"$rows_left_out":16}
{"sheet":"Amortissements","index":5,"n_rows":12,"n_cols":32,"rows_kept":12,"cut":false,"hidden":false,"merged":[[0,0,0,7],[2,0,2,7]]}
["Tableau d'amortissement d'équipements de R&D"]
[]
["(comptes éligibles du PGC : 6122, 6135 et 6811)",null,null,null,null,null,null,null,null,null,null,null,"PASSER LA SOURIS SUR LES CELLULES BLEUES POUR VISUALISER LES COMMENTAIRES"]
[null,null,null,null,null,null,null,null,null,"ONGLET A REMPLIR OBLIGATOIREMENT"]
["Lot","Tache","Sous-tâche","Code","Intitulé de l'activité","Partenaire","Désignation et description\nde l'équipement amorti","Valeur d'acquisition (€)","Semestre projet d'acquisition","Durée d'amortissement comptable (en semestre)","Amortissement semestriel (€)","Nombre de semestre d'utilisation dans le cadre du projet ","Part d'utilisation affectée au projet (%)","Contribution aux amortissements sur le semestre (€)","Commentaires"]
[null,null,null,{"$f":"CONCATENATE(A6,B6,C6)","v":""},{"$f":"IFERROR(VLOOKUP(CONCATENATE(A6,B6,C6),'Structure projet '!E:F,2,FALSE),\"\")","v":0},null,null,null,null,null,{"$f":"IF(F6=\"\",\"\",H6/J6)","v":""},null,null,{"$f":"IF(F6=\"\",\"\",K6*M6*L6)","v":""}]
{"$rows_left_out":7}
{"sheet":"Description des couts ","index":6,"n_rows":11,"n_cols":32,"rows_kept":11,"cut":false,"hidden":false,"merged":[[0,0,0,8],[1,0,1,8]]}
["Description des coûts"]
[null,null,null,null,null,null,null,null,null,null,null,"PASSER LA SOURIS SUR LES CELLULES BLEUES POUR VISUALISER LES COMMENTAIRES"]
[null,null,null,null,null,null,null,null,null,"ONGLET A REMPLIR OBLIGATOIREMENT"]
["Lot","Tache","Sous-tâche","Code","Intitulé de l'activité","Partenaire","Semestre d'utilisation","Nature des coûts","Fournisseur pressenti","Localisation","Bien acheté","Montant unitaire (€)","Commentaires"]
[null,null,null,{"$f":"CONCATENATE(A5,B5,C5)","v":""},{"$f":"IFERROR(VLOOKUP(CONCATENATE(A5,B5,C5),'Structure projet '!E:F,2,FALSE),\"\")","v":0},null,null,null,null,null,null,null,null,null,null,null,null,null,null,null,null,null,null,null,null,null,null,null,null,null,null,"NR"]
[null,null,null,{"$f":"CONCATENATE(A6,B6,C6)","v":""},{"$f":"IFERROR(VLOOKUP(CONCATENATE(A6,B6,C6),'Structure projet '!E:F,2,FALSE),\"\")","v":0},null,null,null,null,null,null,null,null,null,null,null,null,null,null,null,null,null,null,null,null,null,null,null,null,null,null,"NR"]
{"$rows_left_out":6}
{"sheet":"Synthese","index":7,"n_rows":102,"n_cols":21,"rows_kept":102,"cut":false,"hidden":false,"merged":[[0,3,0,7]]}
[null,null,null,"Synthèse des coûts du projet"]
[null,null,null,"Copier / coller ce tableau dans le dossier de candidature"]
[null,null,null,null,"Étiquettes de colonnes"]
[null,null,null,"Valeurs","(vide)","Total général"]
[null,null,null,"Salaires chargés environnés :",0,0]
[null,null,null,"dont salaires permanents :"]
{"$rows_left_out":97}
{"sheet":"Aide prévisionnelle","index":8,"n_rows":43,"n_cols":11,"rows_kept":43,"cut":false,"hidden":false,"merged":[[0,2,0,6]]}
[null,null,"Aide prévisionnelle au projet"]
[]
[null,null,"Étiquettes de lignes","Coûts totaux","Assiette retenue des coûts éligibles","Montant de subventions","Montant d'avance remboursable","Montant d'aide totale"]
[null,null,"(vide)",0,0,0,0,0]
[null,null,"Total général",0,0,0,0,0]
[]
{"$rows_left_out":38}
{"sheet":"CheckList","index":9,"n_rows":127,"n_cols":13,"rows_kept":127,"cut":false,"hidden":false,"merged":[[122,1,122,2],[122,3,122,4],[122,6,122,7],[122,8,122,9],[43,2,43,4],[83,2,83,4],[96,2,96,4],[119,1,119,3],[108,1,108,3],[109,2,109,4],[110,2,110,4],[8,1,8,3],[1,1,1,3],[19,1,19,3],[25,1,25,3],[20,2,20,4],[9,2,9,4],[10,2,10,4],[26,2,26,4],[36,2,36,4],[42,1,42,3],[82,1,82,3],[95,1,95,3],[64,1,64,3],[35,1,35,3],[65,2,65,4]]}
[]
[null,"Contrôle Nb Homme.mois",null,null,null,null,"Paramètre"]
[null,null,"Part des ETP projet par rapport ETP entreprise :",null,null,{"$f":"IF(MAX(C7:H7)<G3,1,0)","v":1},0.3]
[null,null,"Étiquettes de colonnes"]
[null,null,"(vide)"]
[null,"Total Homme.mois ",0]
{"$rows_left_out":122}
{"sheet":"Synthèse par LOT","index":10,"n_rows":14,"n_cols":12,"rows_kept":14,"cut":false,"hidden":false,"merged":[]}
["Partenaire","(vide)"]
[]
[null,null,"Étiquettes de colonnes"]
[null,null,"   ",null,"Total éligibles et retenus en €","Groupe2",null,"Total éligibles et retenus en €","Total des dépenses pour l'opération en €"]
["Étiquettes de lignes","Valeurs","Total RI","Total DE",null,"Total NE","Total NR",null,null,null,"Contrôles :"]
["Total Salaires chargés non environnés :",null,null,null,null,null,null,null,0,null,"Salaires chargés non environnés :",{"$f":"IF(SUMIF(B6:B200,\"Salaires chargés non environnés :\",F6:F200)=SUMIF(A6:A200,\"Total Salaires chargés non environnés :\",F6:F200),1,0)","v":1}]
{"$rows_left_out":8}